{"text_format":"1","workbook":"xlsx","n_sheets":8,"sheets":["Reporting on MARSs and SBSs","Totals","EUSBSR","EUSDR","EUSAIR","EUSALP","ATLSBS","Basic Data Draft"],"not_rendered":{"charts":0,"images":104,"macros":1,"external_links":0,"defined_names":3,"comments":0,"pivot_tables":0},"unopened":[],"bounds":{"document_bytes":16777216,"sheet_cells":100000,"rows_first":2000,"rows_last":500,"rows_between":2000,"halvings":0,"cell_chars":16384,"cell_head_chars":4096},"cells_cut":0,"cells_raw":0,"read":"whole","date_system":"1900"}

{"sheet":"Reporting on MARSs and SBSs","index":0,"n_rows":44,"n_cols":7,"rows_kept":44,"cut":false,"hidden":true,"merged":[[2,5,2,6],[2,0,2,3],[0,0,0,3]]}
["[IfGJ template – to be inserted in Annual Implementation Report part B point 14.4]"]
[]
["As stipulated by the Regulation (EU) No 1303/2013, article 27 (3) on the “content of programmes”, article 96 (3) (e) on the “content, adoption and amendment of operational programmes under the Investment for growth and jobs goal”, article 111(3), article (4)(d) on “implementation reports for the Investment for growth and jobs goal”, and Annex 1, section 7.3 on “contribution of mainstream programmes to macro-regional and sea-basin strategies, this programme contributes to MRS (s) and/or SBS:"]
[null,"MRSs",null,{"$f":"IF(A4=F4,\" \",\"MRSs\")","v":"MRSs"},null,true]
[]
[null,{"$f":"IF($D$4=$B$4,\"EU Strategy for the Baltic Sea Region (EUSBSR)\",\" \")","v":"EU Strategy for the Baltic Sea Region (EUSBSR)"},null,{"$f":"IF(A6=F6,\" \",\"EU Strategy for the Baltic Sea Region (EUSBSR)\")","v":"EU Strategy for the Baltic Sea Region (EUSBSR)"},null,true,{"$f":"CHOOSE($D$4=$B$4,#REF!,#REF!,#REF!,#REF!)","v":{"$error":"#REF!"}}]
[]
[null,{"$f":"IF($D$4=$B$4,\"EU Strategy for the Danube Region (EUSDR)\",\" \")","v":"EU Strategy for the Danube Region (EUSDR)"},null,{"$f":"IF(A8=F8,\" \",\"EU Strategy for the Danube Region (EUSDR)\")","v":"EU Strategy for the Danube Region (EUSDR)"},null,true,{"$f":"CHOOSE($D$4=$B$4,#REF!,#REF!,#REF!,F62)","v":{"$error":"#REF!"}}]
[]
[null,{"$f":"IF($D$4=$B$4,\"EU Strategy for the Adriatic and Ionian Region (EUSAIR)\",\" \")","v":"EU Strategy for the Adriatic and Ionian Region (EUSAIR)"},null,{"$f":"IF(A10=F10,\" \",\"EU Strategy for the Adriatic and Ionian Region (EUSAIR)\")","v":" "},null,false,{"$f":"CHOOSE($D$4=$B$4,#REF!,#REF!,F62,F63)","v":{"$error":"#REF!"}}]
[]
[null,{"$f":"IF($D$4=$B$4,\"EU Strategy for the Alpine Region (EUSALP)\",\" \")","v":"EU Strategy for the Alpine Region (EUSALP)"},null,{"$f":"IF(A12=F12,\" \",\"EU Strategy for the Alpine Region (EUSALP)\")","v":" "},null,false,{"$f":"CHOOSE($D$4=$B$4,#REF!,F62,F63,F64)","v":{"$error":"#REF!"}}]
[]
[null,"SBSs",null,{"$f":"IF(A14=F14,,\"SBSs\")","v":"SBSs"},null,true]
[]
[null,"EUSBSR","EUSDR","EUSAIR","EUSALP"]
[null,"Please specify the Objective (s), Policy Area(s), and Horizontal Action(s) of EUSBSR that your programme is relevant to:",{"$f":"EUSDR!B2","v":"Please specify the Pillar (s) and Priority Area(s) of the EUSDR that your programme is relevant to:"}]
[]
[]
[null,"EUSBSR",{"$f":"IF($F$8=FALSE,\" \",EUSDR!B1)","v":"EUSDR"}]
[null,{"$f":"IF($F$6=FALSE,\" \",EUSBSR!B2)","v":"Please specify the Objective (s), Policy Area(s), and Horizontal Action(s) of the EUSBSR that your programme is relevant to:"},{"$f":"IF($F$8=FALSE,\" \",EUSDR!B2)","v":"Please specify the Pillar (s) and Priority Area(s) of the EUSDR that your programme is relevant to:"}]
[null,{"$f":"IF($F$6=FALSE,\" \",EUSBSR!B3)","v":"1. Objective 1:  \" Save the Sea\""},{"$f":"IF($F$8=FALSE,\" \",EUSDR!B3)","v":"1. Pillar 1: \"Connecting the Danube Region\""}]
[null,{"$f":"IF($F$6=FALSE,\" \",EUSBSR!B4)","v":"2. Objective 2: \"Connect the Region\""},{"$f":"IF($F$8=FALSE,\" \",EUSDR!B4)","v":"1.1  Mobility - Waterways"}]
[null,{"$f":"IF($F$6=FALSE,\" \",EUSBSR!B5)","v":"3. Objective 3: \"Increase Prosperity\""},{"$f":"IF($F$8=FALSE,\" \",EUSDR!B5)","v":"1.2 Mobility- Rail, road & air"}]
[null,{"$f":"IF($F$6=FALSE,\" \",EUSBSR!B6)","v":"4. Policy Areas:"},{"$f":"IF($F$8=FALSE,\" \",EUSDR!B6)","v":"1.3 Energy"}]
[null,{"$f":"IF($F$6=FALSE,\" \",EUSBSR!B7)","v":"4.1 BIOECONOMY"},{"$f":"IF($F$8=FALSE,\" \",EUSDR!B7)","v":"1.4 Culture and Tourism"}]
[null,{"$f":"IF($F$6=FALSE,\" \",EUSBSR!B8)","v":"4.2 CULTURE"},{"$f":"IF($F$8=FALSE,\" \",EUSDR!B8)","v":"2. Pillar 2: \"Protecting the Environment in the Danube Region\""}]
[null,{"$f":"IF($F$6=FALSE,\" \",EUSBSR!B9)","v":"4.3 EDUCATION"},{"$f":"IF($F$8=FALSE,\" \",EUSDR!B9)","v":"2.1 Priority Areas (with scroll bar selection):"}]
[null,{"$f":"IF($F$6=FALSE,\" \",EUSBSR!B10)","v":"4.4 ENERGY"},{"$f":"IF($F$8=FALSE,\" \",EUSDR!B10)","v":"2.2 Water Quality "}]
[null,{"$f":"IF($F$6=FALSE,\" \",EUSBSR!B11)","v":"4.5 HAZARDS"},{"$f":"IF($F$8=FALSE,\" \",EUSDR!B11)","v":"2.3 Environmental Risks"}]
[null,{"$f":"IF($F$6=FALSE,\" \",EUSBSR!B12)","v":"4.6 HEALTH"},{"$f":"IF($F$8=FALSE,\" \",EUSDR!B12)","v":"2.4 Biodiversity, landscapes, air and soil quality "}]
[null,{"$f":"IF($F$6=FALSE,\" \",EUSBSR!B13)","v":"4.7 INNOVATION"},{"$f":"IF($F$8=FALSE,\" \",EUSDR!B13)","v":"3. Pillar 3: \"Building Prosperity in the Danube Region\""}]
[null,{"$f":"IF($F$6=FALSE,\" \",EUSBSR!B14)","v":"4.8 NUTRI"},{"$f":"IF($F$8=FALSE,\" \",EUSDR!B14)","v":"3.1 Priority Areas (with scroll bar selection):"}]
[null,{"$f":"IF($F$6=FALSE,\" \",EUSBSR!B15)","v":"4.9 SAFE"},{"$f":"IF($F$8=FALSE,\" \",EUSDR!B15)","v":"3.2 Knowledge society"}]
[null,{"$f":"IF($F$6=FALSE,\" \",EUSBSR!B16)","v":"4.10 SECURE"},{"$f":"IF($F$8=FALSE,\" \",EUSDR!B16)","v":"3.3 Competitiveness"}]
[null,{"$f":"IF($F$6=FALSE,\" \",EUSBSR!B17)","v":"4.11 SHIP"},{"$f":"IF($F$8=FALSE,\" \",EUSDR!B17)","v":"3.4 People & Skills"}]
[null,{"$f":"IF($F$6=FALSE,\" \",EUSBSR!B18)","v":"4.12 TOURISM"},{"$f":"IF($F$8=FALSE,\" \",EUSDR!B18)","v":"4. Pillar 4: \"Strengthening the Danube Region\""}]
[null,{"$f":"IF($F$6=FALSE,\" \",EUSBSR!B19)","v":"4.13 TRANSPORT"},{"$f":"IF($F$8=FALSE,\" \",EUSDR!B19)","v":"4.1 Priority Areas (with scroll bar selection):"}]
[null,{"$f":"IF($F$6=FALSE,\" \",EUSBSR!B20)","v":"5. Horizontal Actions:"},{"$f":"IF($F$8=FALSE,\" \",EUSDR!B20)","v":"4.2 Institutional Capacity & Cooperation"}]
[null,{"$f":"IF($F$6=FALSE,\" \",EUSBSR!B21)","v":"5.1 CAPACITY"},{"$f":"IF($F$8=FALSE,\" \",EUSDR!B21)","v":"4.3 Security"}]
[null,{"$f":"IF($F$6=FALSE,\" \",EUSBSR!B22)","v":"5.2 CLIMATE"},null,null,null,true]
[null,{"$f":"IF($F$6=FALSE,\" \",EUSBSR!B23)","v":"5.3 NEIGHBOURS"}]
[null,{"$f":"IF($F$6=FALSE,\" \",EUSBSR!B24)","v":"5.4 SPATIAL PLANNING"}]
[null,{"$f":"IF($F$6=FALSE,\" \",EUSBSR!B25)","v":0}]

{"sheet":"Totals","index":1,"n_rows":6,"n_cols":9,"rows_kept":6,"cut":false,"hidden":true,"merged":[]}
[null,"ERDF","CF","ESF","EAFRD","EMFF","ENI","IPA","OTHER"]
[{"$f":"REPLACE(CELL(\"filename\",EUSBSR!A1),1,FIND(\"]\",CELL(\"filename\",EUSBSR!A1)),\"\")","v":"EUSBSR"}]
[{"$f":"REPLACE(CELL(\"filename\",EUSDR!A1),1,FIND(\"]\",CELL(\"filename\",EUSDR!A1)),\"\")","v":"EUSDR"}]
[{"$f":"REPLACE(CELL(\"filename\",EUSAIR!A1),1,FIND(\"]\",CELL(\"filename\",EUSAIR!A1)),\"\")","v":"EUSAIR"}]
[{"$f":"REPLACE(CELL(\"filename\",EUSALP!A1),1,FIND(\"]\",CELL(\"filename\",EUSALP!A1)),\"\")","v":"EUSALP"}]
[{"$f":"REPLACE(CELL(\"filename\",ATLSBS!A1),1,FIND(\"]\",CELL(\"filename\",ATLSBS!A1)),\"\")","v":"ATLSBS"},"",""]

{"sheet":"EUSBSR","index":2,"n_rows":31,"n_cols":6,"rows_kept":31,"cut":false,"hidden":true,"merged":[]}
[null,"EUSBSR",null,null,"EU Strategy for the Baltic Sea Region (EUSBSR)"]
[null,"Please specify the Objective (s), Policy Area(s), and Horizontal Action(s) of the EUSBSR that your programme is relevant to:",null,null,"What were the actions or mechanisms used to better link the programme with the EUSBSR:","Amounts in Euro"]
[null,"1. Objective 1:  \" Save the Sea\"",null,null,"A. Are macro-regional coordinators (mainly National Coordinators, Policy Area Coordinators, Horizontal Action Coordinators, or members of the Steering Committees/Coordination Groups) participating in the Monitoring Committee of the programme? "]
[null,"2. Objective 2: \"Connect the Region\""]
[null,"3. Objective 3: \"Increase Prosperity\"",null,null,"If Yes:"]
[null,"4. Policy Areas:",null,null,"Please provide name and function:"]
[null,"4.1 BIOECONOMY",null,null,"B. In selection criteria, have extra points been attributed to specific measures supporting the EUSBSR?"]
[null,"4.2 CULTURE"]
[null,"4.3 EDUCATION",null,null,"If Yes:"]
[null,"4.4 ENERGY",null,null,"a)     Are targeted calls for proposals planned in relation to the EUSBSR?"]
[null,"4.5 HAZARDS",null,null,"b)      How many macro-regional projects/actions are already supported by the programme? (Number)"]
[null,"4.6 HEALTH",null,null,"c)      Were extra points/bonus given to a project/action with high macro-regional significance or impact? If yes, please elaborate (1 specific sentence)"]
[null,"4.7 INNOVATION"]
[null,"4.8 NUTRI",null,null,"d)    Other actions (eg. planned strategic projects). Please elaborate (1 specific sentence)"]
[null,"4.9 SAFE"]
[null,"4.10 SECURE",null,null,"C. Has the programme invested EU funds in the EUSBSR? "]
[null,"4.11 SHIP"]
[null,"4.12 TOURISM",null,null,"If Yes"]
[null,"4.13 TRANSPORT",null,null,"Approximate or exact amount invested in the EUSBSR:"]
[null,"5. Horizontal Actions:",null,null,"ERDF"]
[null,"5.1 CAPACITY",null,null,"CF"]
[null,"5.2 CLIMATE",null,null,"ESF"]
[null,"5.3 NEIGHBOURS",null,null,"EAFRD"]
[null,"5.4 SPATIAL PLANNING",null,null,"EMFF"]
[null,null,null,null,"ENI"]
[null,null,null,null,"any other fund"]
[null,null,null,null,"If \"any other fund\" please name the fund"]
[null,null,null,null,"If No"]
[null,null,null,null,"Does your programme plan to invest in the EUSBSR in the future? Please elaborate (1 specific sentence)"]
[]
[null,null,null,null,"D. Please indicate the obtained results in relation to the EUSBSR (n.a. for 2016)"]

{"sheet":"EUSDR","index":3,"n_rows":32,"n_cols":6,"rows_kept":32,"cut":false,"hidden":false,"merged":[]}
[null,"EUSDR",null,null,"EU Strategy for the Danube Region (EUSDR)"]
[null,"Please specify the Pillar (s) and Priority Area(s) of the EUSDR that your programme is relevant to:",null,null,"What were the actions or mechanisms used to better link the programme with the EUSDR:","AMOUNTS in Euro"]
[null,"1. Pillar 1: \"Connecting the Danube Region\"",null,null,"A. Are macro-regional coordinators (mainly National Coordinators, Priority Area Coordinators, or Steering Group members) participating in the Monitoring Committee of the programme? "]
[null,"1.1  Mobility - Waterways"]
[null,"1.2 Mobility- Rail, road & air",null,null,"If Yes:"]
[null,"1.3 Energy",null,null,"Please provide name and function:"]
[null,"1.4 Culture and Tourism",null,null,"B. In selection criteria, have extra points been attributed to specific measures supporting the EUSDR?"]
[null,"2. Pillar 2: \"Protecting the Environment in the Danube Region\""]
[null,"2.1 Priority Areas (with scroll bar selection):",null,null,"If Yes:"]
[null,"2.2 Water Quality ",null,null,"a)     Are targeted calls for proposals planned in relation to the EUSDR?"]
[null,"2.3 Environmental Risks",null,null,"b)     How many macro-regional projects/actions are already supported by the programme?(Number)"]
[null,"2.4 Biodiversity, landscapes, air and soil quality ",null,null,"c)      Were extra points / bonus given to a project/action with high macro-regional significance or impact? If yes, please elaborate (1 specific sentence)"]
[null,"3. Pillar 3: \"Building Prosperity in the Danube Region\""]
[null,"3.1 Priority Areas (with scroll bar selection):",null,null,"d)    Other actions (eg. planned strategic projects). Please elaborate (1 specific sentence)"]
[null,"3.2 Knowledge society"]
[null,"3.3 Competitiveness",null,null,"C. Has the programme invested EU funds in the EUSDR? "]
[null,"3.4 People & Skills"]
[null,"4. Pillar 4: \"Strengthening the Danube Region\"",null,null,"If Yes"]
[null,"4.1 Priority Areas (with scroll bar selection):",null,null,"Approximate or exact amount invested in the EUSDR:"]
[null,"4.2 Institutional Capacity & Cooperation",null,null,"ERDF"]
[null,"4.3 Security",null,null,"CF"]
[null,null,null,null,"ESF"]
[null,null,null,null,"EAFRD"]
[null,null,null,null,"EMFF"]
[null,null,null,null,"ENI"]
[null,null,null,null,"IPA"]
[null,null,null,null,"any other fund"]
[null,null,null,null,"If \"any other fund\" please name the fund"]
[null,null,null,null,"If No"]
[null,null,null,null,"Does your programme plan to invest in the EUSDR in the future? Please elaborate (1 specific sentence)"]
[]
[null,null,null,null,"D. Please indicate the obtained results in relation to the EUSDR (n.a. for 2016)"]

{"sheet":"EUSAIR","index":4,"n_rows":31,"n_cols":5,"rows_kept":31,"cut":false,"hidden":true,"merged":[]}
[null,"EUSAIR",null,"EU Strategy for the Adriatic and Ionian Region (EUSAIR)"]
[null,"Please specify the Pillar(s), Topic(s), and/or Cross Cutting Issue (s) of EUSAIR that your programme is relevant to:",null,"What were the actions or mechanisms used to better link the programme with the EUSAIR:","AMOUNTS in Euro"]
[null,"1. Pillar 1: \"BLUE GROWTH\"",null,"A. Are macro-regional coordinators (mainly National Coordinators, Pillar Coordinators, or Thematic Steering Group members) participating in the Monitoring Committee of the programme? "]
[null,"1.1.1 Blue technologies "]
[null,"1.1.2 Fisheries and aquaculture ",null,"If Yes:"]
[null,"1.1.3 Maritime and marine governance and services",null,"Please provide name and function:"]
[null,"1.2.1 Strengthening R&D, Innovation ",null,"B. In selection criteria, have extra points been attributed to specific measures supporting the EUSAIR?"]
[null,"1.2.2 SMEs development"]
[null,"1.2.3 Capacity building",null,"If Yes:"]
[null,"2. Pillar 2: \"CONNECTING THE REGION\"",null,"a)     Are targeted calls for proposals planned in relation to the EUSAIR?"]
[null,"2.1.1 Maritime transport ",null,"b)     How many macro-regional projects/actions are already supported by the programme? (Number)"]
[null,"2.1.2 Intermodal connections to the hinterland",null,"c)     Were extra points / bonus given to a project/action with high macro-regional significance or impact? If yes, please elaborate (1 specific sentence)"]
[null,"2.1.3 Energy networks"]
[null,"2.2.1 Strengthening R&D, Innovation ",null,"d)    Other actions (eg. planned strategic projects). Please elaborate (1 specific sentence)"]
[null,"2.2.2  SMEs development"]
[null,"2.2.3 Capacity building",null,"C. Has the programme invested EU funds in the EUSAIR? "]
[null,"3. Pillar 3: \"ENVIRONMENTAL QUALITY\""]
[null,"3.1.1 The marine environment",null,"If Yes"]
[null,"3.1.2 Transnational terrestrial habitats and biodiversity",null,"Approximate or exact amount invested in the EUSAIR:"]
[null,"3.2.1 Strengthening R&D, Innovation ",null,"ERDF"]
[null,"3.2.2 SMEs development",null,"CF"]
[null,"3.2.3 Capacity building",null,"ESF"]
[null,"4. Pillar 4: \" SUSTAINABLE TOURISM \"",null,"EAFRD"]
[null,"4.1.1 Diversified tourism offer (products and services)",null,"EMFF"]
[null,"4.1.2 Sustainable and responsible tourism management (innovation and quality)",null,"IPA"]
[null,"4.2.1 Strengthening R&D, Innovation ",null,"any other fund"]
[null,"4.2.2 SMEs development",null,"If \"any other fund\" please name the fund"]
[null,"4.2.3 Capacity building",null,"If No"]
[null,null,null,"Does your programme plan to invest in the EUSAIR in the future? Please elaborate (1 specific sentence)"]
[]
[null,null,null,"D. Please indicate the obtained results in relation to the EUSAIR (n.a. for 2016)"]

{"sheet":"EUSALP","index":5,"n_rows":30,"n_cols":6,"rows_kept":30,"cut":false,"hidden":true,"merged":[]}
[null,"EUSALP",null,null,"EU Strategy for the Alpine Region (EUSALP)"]
[null,"Please specify the Thematic Policy Area (s) and Action (s), and/or the Horizontal issue (governance), of the EUSALP that your programme is relevant to:",null,null,"What were the actions or mechanisms used to better link the programme with the EUSALP:","AMOUNTS in Euro"]
[null,"1. THEMATIC POLICY AREA 1: Economic Growth and Innovation",null,null,"A. Are macro-regional coordinators (mainly National Coordinators, Policy Area Coordinators or members) participating in the Monitoring Committee of the programme? "]
[null,"1.1.1 Action 1: Research and innovation ecosystem"]
[null,"1.1.2 Action 2: Economic potential of strategic sectors",null,null,"If Yes:"]
[null,"1.1.3 Action 3: Economic and social environment of economic operators in strategic sectors (incl. labour market, education and training)",null,null,"Please provide name and function:"]
[null,"1.2.1 Governance",null,null,"B. In selection criteria, have extra points been attributed to specific measures supporting the EUSALP?"]
[null,"2. THEMATIC POLICY AREA 2: Mobility and Connectivity"]
[null,"2.1.1 Action 4: Intermodality and interoperability in passenger and freight transport",null,null,"If Yes:"]
[null,"2.1.2 Action 5: E-connect people (digital agenda) and accessibility to public services",null,null,"a)     Are targeted calls for proposals planned in relation to the EUSALP?"]
[null,"2.2.1 Governance",null,null,"b)      How many macro-regional projects/actions are already supported by the programme? (Number)"]
[null,"3. THEMATIC POLICY AREA 3: Environment and Energy",null,null,"c)       Were extra points / bonus given to a project/action with high macro-regional significance or impact? If yes, please elaborate (1 specific sentence)"]
[null,"3.1.1 Action 6: natural resources (incl. water and cultural resources)"]
[null,"3.1.2 Action 7: ecological connectivity ",null,null,"d)    Other actions (eg. planned strategic projects). Please elaborate (1 specific sentence)"]
[null,"3.1.3 Action 8: risk and climate change management (incl. major natural risks prevention)"]
[null,"3.1.4 Action 9: energy efficiency and renewable energy",null,null,"C. Has the programme invested EU funds in the EUSALP? "]
[null,"3.2.1 Governance"]
[null,null,null,null,"If Yes"]
[null,null,null,null,"Approximate or exact amount invested in the EUSALP:"]
[null,null,null,null,"ERDF"]
[null,null,null,null,"CF"]
[null,null,null,null,"ESF"]
[null,null,null,null,"EAFRD"]
[null,null,null,null,"EMFF"]
[null,null,null,null,"any other fund"]
[null,null,null,null,"If \"any other fund\" please name the fund"]
[null,null,null,null,"If No"]
[null,null,null,null,"Does your programme plan to invest in the EUSALP in the future? Please elaborate (1 specific sentence)"]
[]
[null,null,null,null,"D. Please indicate the obtained results in relation to the EUSALP (n.a. for 2016)"]

{"sheet":"ATLSBS","index":6,"n_rows":30,"n_cols":6,"rows_kept":30,"cut":false,"hidden":true,"merged":[]}
[null,"Atlantic Sea Basin Strategy",null,null,"Atlantic Sea Basin Strategy (SBS)"]
[null,"Please specify the Priority (s) and Objective (s) of the Atlantic Sea Basin Strategy that your programme is relevant to:",null,null,"What were the actions or mechanisms used to better link the programme with the Atlantic SBS:","AMOUNTS in Euro"]
[null,"1. Priority 1: Promote entrepreneurship and innovation ",null,null,"A. Are the Sea Basin Strategic coordinators (mainly National Coordinators, Priority Area Coordinators or members, and/or Objective coordinators or members) participating in the Monitoring Committee of the programme? "]
[null,"1.1 Objective 1: sharing knowledge between higher education organisations, companies and research centers"]
[null,"1.2 Objective 2: enhancement of competitiveness and innovation capacities in the maritime economy of the Atlantic area",null,null,"If Yes:"]
[null,"1.3 Objective 3:fostering adaptation and diversification of economic activities by promoting the potential of the Atlantic area",null,null,"Please provide name and function:"]
[null,"2. Priority 2: Protect, secure and develop the potential of the Atlantic marine and coastal environment ",null,null,"B. In selection criteria, have extra points been attributed to specific measures supporting the Atlantic SBS?"]
[null,"2.1 Objective 1: improving maritime safety and security"]
[null,"2.2 Objective 2: exploring and protecting marine waters and coastal zones",null,null,"If Yes:"]
[null,"2.3 Objective 3: sustainable management of marine resources",null,null,"a)      Are targeted calls for proposals planned in relation to the Atlantic SBS? "]
[null,"2.4 Objective 4: exploitation of the renewable energy potential of the Atlantic area's marine and coastal environment ",null,null,"b)       How many macro-regional projects/actions are already supported by the programme?(Number)"]
[null,"3. Priority 3: Improve accessibility and connectivity",null,null,"c)      Were extra points / bonus given to a project/action with high macro-regional significance or impact? If yes, please elaborate (1 specific sentence)"]
[null,"3.1 Objective 1: promoting cooperation between ports "]
[null,"4. Priority 4: Create a socially inclusive and sustainable model of regional development",null,null,"d)    Other actions (eg. planned strategic projects). Please elaborate (1 specific sentence)"]
[null,"4.1 Objective 1: fostering better knowledge of social challenges in the Atlantic area "]
[null,"4.2 Objective 2: preserving and promoting the Atlantic's cultural heritage",null,null,"C. Has the programme invested EU funds in the Atlantic SBS? "]
[]
[null,null,null,null,"If Yes"]
[null,null,null,null,"Approximate or exact amount invested in the Atlantic SBS:"]
[null,null,null,null,"ERDF"]
[null,null,null,null,"CF"]
[null,null,null,null,"ESF"]
[null,null,null,null,"EAFRD"]
[null,null,null,null,"EMFF"]
[null,null,null,null,"any other fund"]
[null,null,null,null,"If \"any other fund\" please name the fund"]
[null,null,null,null,"If No"]
[null,null,null,null,"Does your programme plan to invest in the Atlantic SBS in the future? Please elaborate (1 specific sentence)"]
[]
[null,null,null,null,"D. Please indicate the obtained results in relation to the Atlantic SBS (n.a. for 2016)"]

{"sheet":"Basic Data Draft","index":7,"n_rows":328,"n_cols":3,"rows_kept":328,"cut":false,"hidden":true,"merged":[]}
[null,"[IfGJ template – to be inserted in Annual Implementation Report part B point 14.4]"]
[]
[null,"As stipulated by the Regulation (EU) No 1303/2013, article 27 (3) on the “content of programmes”, article 96 (3) (e) on the “content, adoption and amendment of operational programmes under the Investment for growth and jobs goal”, article 111(3), article (4)(d) on “implementation reports for the Investment for growth and jobs goal”, and Annex 1, section 7.3 on “contribution of mainstream programmes to macro-regional and sea-basin strategies, this programme contributes to MRS (s) and/or SBS:"]
[null,"❑ YES  ❑ NO"]
[]
[null,"If yes,"]
[null,"A. ❑ Macro-regional Strategies:"]
[null,"B. ❑ Sea Basin Strategies:"]
[null,"­­­­­­­­­­­­­­­­­_____________________________________________"]
[null,"A. ❑ Macro-regional Strategies (MRS):"]
[]
[null,"❑ EU Strategy for the Baltic Sea Region (EUSBSR)"]
[null,"❑ EU Strategy for the Danube Region (EUSDR)"]
[null,"❑ EU Strategy for the Adriatic and Ionian Region (EUSAIR)"]
[null,"❑ EU Strategy for the Alpine Region (EUSALP)"]
[null,"­­­­­­­­­­­­______________________________________________________________"]
[null,"❑ EU Strategy for the Baltic Sea Region (EUSBSR)"]
[null,"Box:"]
[null,"Text field of ½ page: "]
[null,"The ½ should contain the following questions:"]
[]
[null,"What were the actions or mechanisms used to better link the programme with EUSBSR (the questions below should be answered with maximum two sentences):"]
[null,"a) Are macro-regional coordinators (mainly National Coordinators, Policy Area Coordinators, Horizontal Action Coordinators, or members of the Steering Committees/Coordination Groups) participating in participating in the Monitoring Committee of the programme? "]
[null,"❑ yes    ❑no"]
[null,"❑ If yes please provide name and function"]
[null,"❑ If not, why (narrative)"]
[null,"…………………………………………………."]
[null,"Have extra points/bonus been attributed to specific measures supporting EUSBSR?"]
[null,"❑yes   ❑no"]
[null,"If Yes:"]
[null,"a)      ❑ Were extra points / bonus given to a project/action with high Macro-regional significance or impact? If yes, please elaborate (narrative)"]
[null,"……………………………………………………………………"]
[null,"b)      ❑ Are targeted calls for proposals foreseen related to EUSBSR?"]
[null,"c)       ❑ How many macro-regional projects/actions are already supported by the programme? (Number) "]
[null,"d)      ❑ Other actions (eg. strategic projects). Please elaborate (narrative)"]
[null,"……………………………………………………………………"]
[]
[null,"❑ Has the programme invested EU funds in EUSBSR? "]
[null,"❑ yes or ❑no"]
[null,"- If Yes"]
[null,"Approximate or exact amount invested in the EUSBSR (this will be reported in a box apart, so we can easily aggregate the information)"]
[null,"❑ ERDF or ❑ ENI, and❑ Total amount"]
[null,"- If No"]
[null,"Does your programme foresee to invest in EUSBSR in the future? (please elaborate) (narrative)"]
[null,"…………………………………….."]
[]
[null,"Please mention the obtained results in relation to the EUSBSR (narrative)"]
[null,"…………………………………………."]
[null,"Please specify the Objective (s), Policy Area(s), and Horizontal Action(s) of EUSBSR that your programme is relevant to:"]
[null,"(Multiple selection)"]
[null,"❑ Objective 1:  \" Save the Sea\""]
[null,"❑ Objective 2: \"Connect the Region\""]
[null,"❑ Objective 3: \"Increase Prosperity\""]
[null,"❑ Policy Areas (with scroll bar and multiple selection selection):"]
[null,"❑ Policy Area BIOECONOMY"]
[null,"❑   Policy Area CULTURE"]
[null,"❑   Policy Area EDUCATION"]
[null,"❑   Policy Area ENERGY"]
[null,"❑   Policy Area HAZARDS"]
[null,"❑   Policy Area HEALTH"]
{"$rows_left_out":268}